Reaction Details
TargetHistamine H3 receptor
LigandBDBM50138112
Substrate/Competitorn/a
Meas. Tech.ChEMBL_1549942 (CHEMBL3755089)
Ki 6.7±n/a nM
Citation Nirogi, RShinde, ATiriveedhi, VKota, LSaraf, SKBadange, RKMohammed, ARSubramanian, RMuddana, NBhyrapuneni, GAbraham, R Benzamide derivatives and their constrained analogs as histamine H3 receptor antagonists. Eur J Med Chem108:655-62 (2016) 
 
Histamine H3 receptor
Name:Histamine H3 receptor
Type:G Protein-Coupled Receptor (GPCR)
Mol. Mass.:48691.47
Organism:Homo sapiens (Human)
Description:Binding assays were using CHO cells stably expressing hH3R receptors.
Residue:445
BDBM50138112
NameBDBM50138112
Synonyms:CHEMBL3753147
TypeSmall organic molecule
Emp. Form.C25H36ClN3O2
Mol. Mass.446.025
SMILESClc1cc(OC2CCN(CC2)C2CCC2)ccc1C(=O)NC1CCN(CC1)C1CCC1