Reaction Details
TargetHistamine H3 receptor
LigandBDBM50138120
Substrate/Competitorn/a
Meas. Tech.ChEMBL_1549942 (CHEMBL3755089)
Ki 5.7±n/a nM
Citation Nirogi, RShinde, ATiriveedhi, VKota, LSaraf, SKBadange, RKMohammed, ARSubramanian, RMuddana, NBhyrapuneni, GAbraham, R Benzamide derivatives and their constrained analogs as histamine H3 receptor antagonists. Eur J Med Chem108:655-62 (2016) 
 
Histamine H3 receptor
Name:Histamine H3 receptor
Type:G Protein-Coupled Receptor (GPCR)
Mol. Mass.:48691.47
Organism:Homo sapiens (Human)
Description:Binding assays were using CHO cells stably expressing hH3R receptors.
Residue:445
BDBM50138120
NameBDBM50138120
Synonyms:CHEMBL3753093
TypeSmall organic molecule
Emp. Form.C22H35N3O2
Mol. Mass.373.5322
SMILESCC(C)N1CCC(C1)NC(=O)c1ccc(OC2CCN(CC2)C(C)C)cc1