Reaction Details
TargetAdenosine receptor A3
LigandBDBM50138568
Substrate/Competitorn/a
Meas. Tech.ChEMBL_1550085 (CHEMBL3756031)
IC50 0.110000±n/a nM
Citation Squarcialupi, LCatarzi, DVarano, FBetti, MFalsini, MVincenzi, FRavani, ACiancetta, AVarani, KMoro, SColotta, V Structural refinement of pyrazolo[4,3-d]pyrimidine derivatives to obtain highly potent and selective antagonists for the human A3 adenosine receptor. Eur J Med Chem108:117-33 (2016) 
 
Adenosine receptor A3
Name:Adenosine receptor A3
Type:G Protein-Coupled Receptor (GPCR)
Mol. Mass.:36197.32
Organism:Homo sapiens (Human)
Description:P0DMS8
Residue:318
BDBM50138568
NameBDBM50138568
Synonyms:CHEMBL3754229
TypeSmall organic molecule
Emp. Form.C23H17N5O2S
Mol. Mass.427.478
SMILESCOc1ccc(cc1)C(=O)Nc1nc(nc2cn(nc12)-c1ccccc1)-c1cccs1