Reaction Details
TargetAdenosine receptor A3
LigandBDBM50138715
Substrate/Competitorn/a
Meas. Tech.ChEMBL_1550085 (CHEMBL3756031)
IC50 1.0±n/a nM
Citation Squarcialupi, LCatarzi, DVarano, FBetti, MFalsini, MVincenzi, FRavani, ACiancetta, AVarani, KMoro, SColotta, V Structural refinement of pyrazolo[4,3-d]pyrimidine derivatives to obtain highly potent and selective antagonists for the human A3 adenosine receptor. Eur J Med Chem108:117-33 (2016) 
 
Adenosine receptor A3
Name:Adenosine receptor A3
Type:G Protein-Coupled Receptor (GPCR)
Mol. Mass.:36197.32
Organism:Homo sapiens (Human)
Description:P0DMS8
Residue:318
BDBM50138715
NameBDBM50138715
Synonyms:CHEMBL3753642
TypeSmall organic molecule
Emp. Form.C21H14N6OS
Mol. Mass.398.44
SMILESO=C(Nc1nc(nc2cn(nc12)-c1ccccc1)-c1cccs1)c1cccnc1