Reaction Details
TargetCholinesterase
LigandBDBM50140174
Substrate/Competitorn/a
Meas. Tech.ChEBML_1549109
IC50 26330±n/a nM
Citation Sun, ZQTu, LXZhuo, FJLiu, SX Design and discovery of Novel Thiazole acetamide derivatives as anticholinesterase agent for possible role in the management of Alzheimer's. Bioorg Med Chem Lett26:747-50 (2016) 
 
Cholinesterase
Name:Cholinesterase
Type:Enzyme
Mol. Mass.:65643.35
Organism:Equus caballus (Horse)
Description:P81908
Residue:574
BDBM50140174
NameBDBM50140174
Synonyms:CHEMBL2403495
TypeSmall organic molecule
Emp. Form.C17H13FN2OS
Mol. Mass.312.361
SMILESFc1ccc(CC(=O)Nc2nc(cs2)-c2ccccc2)cc1