Reaction Details
TargetNeuronal acetylcholine receptor subunit alpha-7
LigandBDBM50142625
Substrate/Competitorn/a
Meas. Tech.ChEMBL_1552366 (CHEMBL3761530)
Ki 1800±n/a nM
Citation Matera, CQuadri, MSciaccaluga, MPomè, DYFasoli, FDe Amici, MFucile, SGotti, CDallanoce, CGrazioso, G Modification of the anabaseine pyridine nucleus allows achieving binding and functional selectivity for thea3ß4 nicotinic acetylcholine receptor subtype. Eur J Med Chem108:392-405 (2016) 
 
Neuronal acetylcholine receptor subunit alpha-7
Name:Neuronal acetylcholine receptor subunit alpha-7
Type:Enzyme
Mol. Mass.:56502.44
Organism:Rattus norvegicus (Rat)
Description:Q05941
Residue:502
BDBM50142625
NameBDBM50142625
Synonyms:CHEMBL3758513
TypeSmall organic molecule
Emp. Form.C13H17NO
Mol. Mass.203.2802
SMILES[H][C@@]12CC[C@@]([H])(N1)[C@H](C2)c1cccc(CO)c1