Reaction Details
TargetNeuronal acetylcholine receptor subunit alpha-7
LigandBDBM50139125
Substrate/Competitorn/a
Meas. Tech.ChEMBL_1552366 (CHEMBL3761530)
Ki 609±n/a nM
Citation Matera, CQuadri, MSciaccaluga, MPomè, DYFasoli, FDe Amici, MFucile, SGotti, CDallanoce, CGrazioso, G Modification of the anabaseine pyridine nucleus allows achieving binding and functional selectivity for thea3ß4 nicotinic acetylcholine receptor subtype. Eur J Med Chem108:392-405 (2016) 
 
Neuronal acetylcholine receptor subunit alpha-7
Name:Neuronal acetylcholine receptor subunit alpha-7
Type:Enzyme
Mol. Mass.:56502.44
Organism:Rattus norvegicus (Rat)
Description:Q05941
Residue:502
BDBM50139125
NameBDBM50139125
Synonyms:CHEMBL3760021
TypeSmall organic molecule
Emp. Form.C12H15NO
Mol. Mass.189.2536
SMILES[H][C@@]12CC[C@@]([H])(N1)[C@H](C2)c1cccc(O)c1