Reaction Details
TargetCarbonic anhydrase 2
LigandBDBM50140309
Substrate/Competitorn/a
Meas. Tech.ChEBML_1551176
Ki 2.6±n/a nM
Citation Durgun, MTurkmen, HCeruso, MSupuran, CT Synthesis of 4-sulfamoylphenyl-benzylamine derivatives with inhibitory activity against human carbonic anhydrase isoforms I, II, IX and XII. Bioorg Med Chem24:982-8 (2016) 
 
Carbonic anhydrase 2
Name:Carbonic anhydrase 2
Type:Enzyme
Mol. Mass.:29250.71
Organism:Homo sapiens (Human)
Description:P00918
Residue:260
BDBM50140309
NameBDBM50140309
Synonyms:CHEMBL248691
TypeSmall organic molecule
Emp. Form.C13H13ClN2O3S
Mol. Mass.312.772
SMILESNS(=O)(=O)c1ccc(NCc2cc(Cl)ccc2O)cc1