Reaction Details
TargetCarbonic anhydrase 12
LigandBDBM50371763
Substrate/Competitorn/a
Meas. Tech.ChEMBL_1551178 (CHEMBL3761626)
Ki 9.9±n/a nM
Citation Durgun, MTurkmen, HCeruso, MSupuran, CT Synthesis of 4-sulfamoylphenyl-benzylamine derivatives with inhibitory activity against human carbonic anhydrase isoforms I, II, IX and XII. Bioorg Med Chem24:982-8 (2016) 
 
Carbonic anhydrase 12
Name:Carbonic anhydrase 12
Type:Enzyme
Mol. Mass.:39456.00
Organism:Homo sapiens (Human)
Description:Catalytic domain of human cloned isozyme was used in the assay
Residue:354
BDBM50371763
NameBDBM50371763
Synonyms:CHEMBL429915
TypeSmall organic molecule
Emp. Form.C14H14N2O2S
Mol. Mass.274.338
SMILESCc1ccc(\C=N\c2ccc(cc2)S(N)(=O)=O)cc1