Reaction Details
TargetCarbonic anhydrase 9
LigandBDBM50229543
Substrate/Competitorn/a
Meas. Tech.ChEMBL_1551177 (CHEMBL3761625)
Ki 454±n/a nM
Citation Durgun, MTurkmen, HCeruso, MSupuran, CT Synthesis of 4-sulfamoylphenyl-benzylamine derivatives with inhibitory activity against human carbonic anhydrase isoforms I, II, IX and XII. Bioorg Med Chem24:982-8 (2016) 
 
Carbonic anhydrase 9
Name:Carbonic anhydrase 9
Type:Enzyme
Mol. Mass.:49669.03
Organism:Homo sapiens (Human)
Description:Catalytic domain of human cloned isozyme was used in the assay
Residue:459
BDBM50229543
NameBDBM50229543
Synonyms:4-(benzylideneamino)benzenesulfonamide CHEMBL408619
TypeSmall organic molecule
Emp. Form.C13H12N2O2S
Mol. Mass.260.312
SMILESNS(=O)(=O)c1ccc(cc1)\N=C\c1ccccc1