Reaction Details
TargetCarbonic anhydrase 1
LigandBDBM50143803
Substrate/Competitorn/a
Meas. Tech.ChEMBL_1551175 (CHEMBL3761623)
Ki 49±n/a nM
Citation Durgun, MTurkmen, HCeruso, MSupuran, CT Synthesis of 4-sulfamoylphenyl-benzylamine derivatives with inhibitory activity against human carbonic anhydrase isoforms I, II, IX and XII. Bioorg Med Chem24:982-8 (2016) 
 
Carbonic anhydrase 1
Name:Carbonic anhydrase 1
Type:Enzyme
Mol. Mass.:28873.37
Organism:Homo sapiens (Human)
Description:P00915
Residue:261
BDBM50143803
NameBDBM50143803
Synonyms:CHEMBL3758614
TypeSmall organic molecule
Emp. Form.C13H14N2O3S
Mol. Mass.278.327
SMILESNS(=O)(=O)c1ccc(NCc2ccccc2O)cc1