Reaction Details
TargetCarbonic anhydrase 9
LigandBDBM50142630
Substrate/Competitorn/a
Meas. Tech.ChEMBL_1551177 (CHEMBL3761625)
Ki 465±n/a nM
Citation Durgun, MTurkmen, HCeruso, MSupuran, CT Synthesis of 4-sulfamoylphenyl-benzylamine derivatives with inhibitory activity against human carbonic anhydrase isoforms I, II, IX and XII. Bioorg Med Chem24:982-8 (2016) 
 
Carbonic anhydrase 9
Name:Carbonic anhydrase 9
Type:Enzyme
Mol. Mass.:49669.03
Organism:Homo sapiens (Human)
Description:Catalytic domain of human cloned isozyme was used in the assay
Residue:459
BDBM50142630
NameBDBM50142630
Synonyms:CHEMBL3758347
TypeSmall organic molecule
Emp. Form.C14H14N2O3S
Mol. Mass.290.338
SMILESCc1cccc(\C=N\c2ccc(cc2)S(N)(=O)=O)c1O