Reaction Details
TargetCarbonic anhydrase 2
LigandBDBM50143803
Substrate/Competitorn/a
Meas. Tech.ChEMBL_1551176 (CHEMBL3761624)
Ki 8.1±n/a nM
Citation Durgun, MTurkmen, HCeruso, MSupuran, CT Synthesis of 4-sulfamoylphenyl-benzylamine derivatives with inhibitory activity against human carbonic anhydrase isoforms I, II, IX and XII. Bioorg Med Chem24:982-8 (2016) 
 
Carbonic anhydrase 2
Name:Carbonic anhydrase 2
Type:Enzyme
Mol. Mass.:29250.71
Organism:Homo sapiens (Human)
Description:P00918
Residue:260
BDBM50143803
NameBDBM50143803
Synonyms:CHEMBL3758614
TypeSmall organic molecule
Emp. Form.C13H14N2O3S
Mol. Mass.278.327
SMILESNS(=O)(=O)c1ccc(NCc2ccccc2O)cc1