Reaction Details
TargetCarbonic anhydrase 12
LigandBDBM50143605
Substrate/Competitorn/a
Meas. Tech.ChEMBL_1551178 (CHEMBL3761626)
Ki 121±n/a nM
Citation Durgun, MTurkmen, HCeruso, MSupuran, CT Synthesis of 4-sulfamoylphenyl-benzylamine derivatives with inhibitory activity against human carbonic anhydrase isoforms I, II, IX and XII. Bioorg Med Chem24:982-8 (2016) 
 
Carbonic anhydrase 12
Name:Carbonic anhydrase 12
Type:Enzyme
Mol. Mass.:39456.00
Organism:Homo sapiens (Human)
Description:Catalytic domain of human cloned isozyme was used in the assay
Residue:354
BDBM50143605
NameBDBM50143605
Synonyms:CHEMBL3758188
TypeSmall organic molecule
Emp. Form.C14H16N2O2S
Mol. Mass.276.354
SMILESCc1ccc(CNc2ccc(cc2)S(N)(=O)=O)cc1