Reaction Details
TargetCarbonic anhydrase 12
LigandBDBM50143803
Substrate/Competitorn/a
Meas. Tech.ChEMBL_1551178 (CHEMBL3761626)
Ki 3±n/a nM
Citation Durgun, MTurkmen, HCeruso, MSupuran, CT Synthesis of 4-sulfamoylphenyl-benzylamine derivatives with inhibitory activity against human carbonic anhydrase isoforms I, II, IX and XII. Bioorg Med Chem24:982-8 (2016) 
 
Carbonic anhydrase 12
Name:Carbonic anhydrase 12
Type:Enzyme
Mol. Mass.:39456.00
Organism:Homo sapiens (Human)
Description:Catalytic domain of human cloned isozyme was used in the assay
Residue:354
BDBM50143803
NameBDBM50143803
Synonyms:CHEMBL3758614
TypeSmall organic molecule
Emp. Form.C13H14N2O3S
Mol. Mass.278.327
SMILESNS(=O)(=O)c1ccc(NCc2ccccc2O)cc1