Reaction Details
TargetCarbonic anhydrase 2
LigandBDBM50143769
Substrate/Competitorn/a
Meas. Tech.ChEMBL_1551176 (CHEMBL3761624)
Ki 3.4±n/a nM
Citation Durgun, MTurkmen, HCeruso, MSupuran, CT Synthesis of 4-sulfamoylphenyl-benzylamine derivatives with inhibitory activity against human carbonic anhydrase isoforms I, II, IX and XII. Bioorg Med Chem24:982-8 (2016) 
 
Carbonic anhydrase 2
Name:Carbonic anhydrase 2
Type:Enzyme
Mol. Mass.:29250.71
Organism:Homo sapiens (Human)
Description:P00918
Residue:260
BDBM50143769
NameBDBM50143769
Synonyms:CHEMBL3760099
TypeSmall organic molecule
Emp. Form.C13H13BrN2O3S
Mol. Mass.357.223
SMILESNS(=O)(=O)c1ccc(NCc2cc(Br)ccc2O)cc1