Reaction Details
TargetL-lactate dehydrogenase B chain
LigandBDBM50010448
Substrate/Competitorn/a
Meas. Tech.ChEMBL_1555231 (CHEMBL3768757)
Ki 92000±n/a nM
Citation Rani, RKumar, V Recent Update on Human Lactate Dehydrogenase Enzyme 5 (hLDH5) Inhibitors: A Promising Approach for Cancer Chemotherapy. J Med Chem59:487-96 (2016) 
 
L-lactate dehydrogenase B chain
Name:L-lactate dehydrogenase B chain
Type:Oxidoreductase; homotetramer
Mol. Mass.:36635.55
Organism:Homo sapiens (Human)
Description:n/a
Residue:334
BDBM50010448
NameBDBM50010448
Synonyms:2,2'-Diimino-5,5'-diisopropyl-7,7'-dimethyl-2H,2'H-[8,8']bi[naphtho[1,8-bc]furanyl]-3,4,3',4'-tetraol | CHEMBL424250
TypeSmall organic molecule
Emp. Form.C30H28N2O6
Mol. Mass.512.5531
SMILESCC(C)c1c(O)c(O)c2C(=N)Oc3c(c(C)cc1c23)-c1c2OC(=N)c3c(O)c(O)c(C(C)C)c(cc1C)c23