Reaction Details
TargetL-lactate dehydrogenase B chain
LigandBDBM50139139
Substrate/Competitorn/a
Meas. Tech.ChEMBL_1555231 (CHEMBL3768757)
Ki 700±n/a nM
Citation Rani, RKumar, V Recent Update on Human Lactate Dehydrogenase Enzyme 5 (hLDH5) Inhibitors: A Promising Approach for Cancer Chemotherapy. J Med Chem59:487-96 (2016) 
 
L-lactate dehydrogenase B chain
Name:L-lactate dehydrogenase B chain
Type:Oxidoreductase; homotetramer
Mol. Mass.:36635.55
Organism:Homo sapiens (Human)
Description:n/a
Residue:334
BDBM50139139
NameBDBM50139139
Synonyms:CHEMBL3765374
TypeSmall organic molecule
Emp. Form.C29H28O8
Mol. Mass.504.5278
SMILESCC(C)c1c(O)c(O)c(C(O)=O)c2cc(ccc12)-c1cc2c(C(O)=O)c(O)c(O)c(C(C)C)c2cc1C