Reaction Details
TargetL-lactate dehydrogenase A chain
LigandBDBM50066976
Substrate/Competitorn/a
Meas. Tech.ChEMBL_1555230 (CHEMBL3768756)
Ki 500±n/a nM
Citation Rani, RKumar, V Recent Update on Human Lactate Dehydrogenase Enzyme 5 (hLDH5) Inhibitors: A Promising Approach for Cancer Chemotherapy. J Med Chem59:487-96 (2016) 
 
L-lactate dehydrogenase A chain
Name:L-lactate dehydrogenase A chain
Type:Protein
Mol. Mass.:36694.85
Organism:Homo sapiens (Human)
Description:P00338::PDB Code: 4ajp
Residue:332
BDBM50066976
NameBDBM50066976
Synonyms:7-Benzyl-2,3-dihydroxy-4,6-dimethyl-naphthalene-1-carboxylic acid | CHEMBL435995
TypeSmall organic molecule
Emp. Form.C20H18O4
Mol. Mass.322.3545
SMILESCc1cc2c(C)c(O)c(O)c(C(O)=O)c2cc1Cc1ccccc1