Reaction Details
TargetCasein kinase I isoform delta
LigandBDBM50139420
Substrate/Competitorn/a
Meas. Tech.ChEBML_1553162
IC50 42±n/a nM
Citation Das, DSikdar, PBairagi, M Recent developments of 2-aminothiazoles in medicinal chemistry. Eur J Med Chem109:89-98 (2016) 
 
Casein kinase I isoform delta
Name:Casein kinase I isoform delta
Type:Enzyme
Mol. Mass.:47342.73
Organism:Rattus norvegicus (rat)
Description:Q06486
Residue:415
BDBM50139420
NameBDBM50139420
Synonyms:CHEMBL3763630
TypeSmall organic molecule
Emp. Form.C19H10ClF4N5O3S
Mol. Mass.499.826
SMILESFc1cc2[nH]c(NC(=O)c3csc(NC(=O)c4ccccc4OC(F)(F)F)n3)nc2cc1Cl