Reaction Details
TargetCasein kinase I isoform epsilon
LigandBDBM50025020
Substrate/Competitorn/a
Meas. Tech.ChEBML_1553163
IC50 199±n/a nM
Citation Das, DSikdar, PBairagi, M Recent developments of 2-aminothiazoles in medicinal chemistry. Eur J Med Chem109:89-98 (2016) 
 
Casein kinase I isoform epsilon
Name:Casein kinase I isoform epsilon
Type:Protein
Mol. Mass.:47340.25
Organism:Homo sapiens (Human)
Description:P49674
Residue:416
BDBM50025020
NameBDBM50025020
Synonyms:CHEMBL3337854
TypeSmall organic molecule
Emp. Form.C20H11F6N5O3S
Mol. Mass.515.388
SMILESFC(F)(F)Oc1ccccc1C(=O)Nc1nc(cs1)C(=O)Nc1nc2ccc(cc2[nH]1)C(F)(F)F