Reaction Details
TargetMitochondrial sodium/calcium exchanger protein
LigandBDBM50139422
Substrate/Competitorn/a
Meas. Tech.ChEBML_1553171
IC50 1600±n/a nM
Citation Martínez-Sanz, FJLajarín-Cuesta, RGonzález-Lafuente, LMoreno-Ortega, AJPunzón, ECano-Abad, MFde los Ríos, C Neuroprotective profile of pyridothiazepines with blocking activity of the mitochondrial Na(+)/Ca(2+) exchanger. Eur J Med Chem109:114-23 (2016) 
 
Mitochondrial sodium/calcium exchanger protein
Name:Mitochondrial sodium/calcium exchanger protein
Type:PROTEIN
Mol. Mass.:64239.77
Organism:Homo sapiens (Human)
Description:ChEMBL_116727
Residue:584
BDBM50139422
NameBDBM50139422
Synonyms:CHEMBL1495071
TypeSmall organic molecule
Emp. Form.C15H11Cl2NOS
Mol. Mass.324.225
SMILESClc1ccc2NC(=O)CSC(c3ccccc3Cl)c2c1