Reaction Details
TargetMelatonin receptor type 1A
LigandBDBM50037242
Substrate/Competitorn/a
Meas. Tech.ChEBML_1553992
Ki 0.150000±n/a nM
Citation Couhert, ADelagrange, PCaignard, DHChartier, ASuzenet, FGuillaumet, G Synthesis of 2-arylfuro[3,2-b]pyridines: Effect of the C2-aryl group on melatoninergic activity. Eur J Med Chem109:268-75 (2016) 
 
Melatonin receptor type 1A
Name:Melatonin receptor type 1A
Type:Enzyme
Mol. Mass.:39392.94
Organism:Homo sapiens (Human)
Description:P48039
Residue:350
BDBM50037242
NameBDBM50037242
Synonyms:CHEMBL323332 N-[2-(5-Methoxy-benzofuran-3-yl)-ethyl]-acetamide
TypeSmall organic molecule
Emp. Form.C13H15NO3
Mol. Mass.233.2631
SMILESCOc1ccc2occ(CCNC(C)=O)c2c1