Reaction Details
TargetMelatonin receptor type 1B
LigandBDBM50340329
Substrate/Competitorn/a
Meas. Tech.ChEBML_1553993
Ki 0.360000±n/a nM
Citation Couhert, ADelagrange, PCaignard, DHChartier, ASuzenet, FGuillaumet, G Synthesis of 2-arylfuro[3,2-b]pyridines: Effect of the C2-aryl group on melatoninergic activity. Eur J Med Chem109:268-75 (2016) 
 
Melatonin receptor type 1B
Name:Melatonin receptor type 1B
Type:Enzyme
Mol. Mass.:40203.54
Organism:Homo sapiens (Human)
Description:P49286
Residue:362
BDBM50340329
NameBDBM50340329
Synonyms:4-azamelatonin | CHEMBL1760944
TypeSmall organic molecule
Emp. Form.C12H15N3O2
Mol. Mass.233.2664
SMILESCOc1ccc2[nH]cc(CCNC(C)=O)c2n1