Reaction Details
TargetMelatonin receptor type 1B
LigandBDBM50139849
Substrate/Competitorn/a
Meas. Tech.ChEBML_1553993
Ki 5.0±n/a nM
Citation Couhert, ADelagrange, PCaignard, DHChartier, ASuzenet, FGuillaumet, G Synthesis of 2-arylfuro[3,2-b]pyridines: Effect of the C2-aryl group on melatoninergic activity. Eur J Med Chem109:268-75 (2016) 
 
Melatonin receptor type 1B
Name:Melatonin receptor type 1B
Type:Enzyme
Mol. Mass.:40203.54
Organism:Homo sapiens (Human)
Description:P49286
Residue:362
BDBM50139849
NameBDBM50139849
Synonyms:CHEMBL3763537
TypeSmall organic molecule
Emp. Form.C26H22N2O3
Mol. Mass.410.4645
SMILESCOc1ccc2oc(c(CCNC(C)=O)c2n1)-c1cc2ccccc2c2ccccc12