Reaction Details
TargetD(3) dopamine receptor
LigandBDBM50140053
Substrate/Competitorn/a
Meas. Tech.ChEMBL_1550150 (CHEMBL3756491)
Ki 120±n/a nM
Citation Cozzi, NVDaley, PF Receptor binding profiles and quantitative structure-affinity relationships of some 5-substituted-N,N-diallyltryptamines. Bioorg Med Chem Lett26:959-64 (2016) 
 
D(3) dopamine receptor
Name:D(3) dopamine receptor
Type:n/a
Mol. Mass.:44243.43
Organism:Homo sapiens (Human)
Description:n/a
Residue:400
BDBM50140053
NameBDBM50140053
Synonyms:CHEMBL3754496
TypeSmall organic molecule
Emp. Form.C16H19FN2
Mol. Mass.258.3339
SMILESFc1ccc2[nH]cc(CCN(CC=C)CC=C)c2c1