Reaction Details
TargetD(2) dopamine receptor
LigandBDBM50140056
Substrate/Competitorn/a
Meas. Tech.ChEMBL_1550149 (CHEMBL3756490)
Ki 5129±n/a nM
Citation Cozzi, NVDaley, PF Receptor binding profiles and quantitative structure-affinity relationships of some 5-substituted-N,N-diallyltryptamines. Bioorg Med Chem Lett26:959-64 (2016) 
 
D(2) dopamine receptor
Name:D(2) dopamine receptor
Type:Cell-surface receptors
Mol. Mass.:50647.10
Organism:Homo sapiens (Human)
Description:P14416
Residue:443
BDBM50140056
NameBDBM50140056
Synonyms:CHEMBL3753318
TypeSmall organic molecule
Emp. Form.C17H22N2
Mol. Mass.254.37
SMILESCc1ccc2[nH]cc(CCN(CC=C)CC=C)c2c1