Reaction Details
TargetSigma non-opioid intracellular receptor 1
LigandBDBM50435344
Substrate/Competitorn/a
Meas. Tech.ChEMBL_1550155 (CHEMBL3756496)
Ki 302±n/a nM
Citation Cozzi, NVDaley, PF Receptor binding profiles and quantitative structure-affinity relationships of some 5-substituted-N,N-diallyltryptamines. Bioorg Med Chem Lett26:959-64 (2016) 
 
Sigma non-opioid intracellular receptor 1
Name:Sigma non-opioid intracellular receptor 1
Type:Enzyme Catalytic Domain
Mol. Mass.:25124.85
Organism:Homo sapiens (Human)
Description:Q99720
Residue:223
BDBM50435344
NameBDBM50435344
Synonyms:CHEMBL2391541
TypeSmall organic molecule
Emp. Form.C17H22N2O
Mol. Mass.270.3694
SMILESCOc1ccc2[nH]cc(CCN(CC=C)CC=C)c2c1