Reaction Details
TargetSigma non-opioid intracellular receptor 1
LigandBDBM50140053
Substrate/Competitorn/a
Meas. Tech.ChEMBL_1550155 (CHEMBL3756496)
Ki 85±n/a nM
Citation Cozzi, NVDaley, PF Receptor binding profiles and quantitative structure-affinity relationships of some 5-substituted-N,N-diallyltryptamines. Bioorg Med Chem Lett26:959-64 (2016) 
 
Sigma non-opioid intracellular receptor 1
Name:Sigma non-opioid intracellular receptor 1
Type:Enzyme Catalytic Domain
Mol. Mass.:25124.85
Organism:Homo sapiens (Human)
Description:Q99720
Residue:223
BDBM50140053
NameBDBM50140053
Synonyms:CHEMBL3754496
TypeSmall organic molecule
Emp. Form.C16H19FN2
Mol. Mass.258.3339
SMILESFc1ccc2[nH]cc(CCN(CC=C)CC=C)c2c1