Reaction Details
Target5-hydroxytryptamine receptor 7
LigandBDBM50140058
Substrate/Competitorn/a
Meas. Tech.ChEMBL_1550142 (CHEMBL3756284)
Ki>10000±n/a nM
Citation Cozzi, NVDaley, PF Receptor binding profiles and quantitative structure-affinity relationships of some 5-substituted-N,N-diallyltryptamines. Bioorg Med Chem Lett26:959-64 (2016) 
 
5-hydroxytryptamine receptor 7
Name:5-hydroxytryptamine receptor 7
Type:G Protein-Coupled Receptor (GPCR)
Mol. Mass.:53573.08
Organism:Homo sapiens (Human)
Description:P34969
Residue:479
BDBM50140058
NameBDBM50140058
Synonyms:CHEMBL3752576
TypeSmall organic molecule
Emp. Form.C16H20N2
Mol. Mass.240.3434
SMILESC=CCN(CCc1c[nH]c2ccccc12)CC=C