Reaction Details
Target5-hydroxytryptamine receptor 6
LigandBDBM50140054
Substrate/Competitorn/a
Meas. Tech.ChEMBL_1550141 (CHEMBL3756283)
Ki 69±n/a nM
Citation Cozzi, NVDaley, PF Receptor binding profiles and quantitative structure-affinity relationships of some 5-substituted-N,N-diallyltryptamines. Bioorg Med Chem Lett26:959-64 (2016) 
 
5-hydroxytryptamine receptor 6
Name:5-hydroxytryptamine receptor 6
Type:G Protein-Coupled Receptor (GPCR)
Mol. Mass.:46968.43
Organism:Homo sapiens (Human)
Description:P50406
Residue:440
BDBM50140054
NameBDBM50140054
Synonyms:CHEMBL3752900
TypeSmall organic molecule
Emp. Form.C16H19ClN2
Mol. Mass.274.788
SMILESClc1ccc2[nH]cc(CCN(CC=C)CC=C)c2c1