Reaction Details
TargetMu-type opioid receptor
LigandBDBM50140058
Substrate/Competitorn/a
Meas. Tech.ChEMBL_1550154 (CHEMBL3756495)
Ki>10000±n/a nM
Citation Cozzi, NVDaley, PF Receptor binding profiles and quantitative structure-affinity relationships of some 5-substituted-N,N-diallyltryptamines. Bioorg Med Chem Lett26:959-64 (2016) 
 
Mu-type opioid receptor
Name:Mu-type opioid receptor
Type:G Protein-Coupled Receptor (GPCR)
Mol. Mass.:44789.51
Organism:Homo sapiens (Human)
Description:P35372
Residue:400
BDBM50140058
NameBDBM50140058
Synonyms:CHEMBL3752576
TypeSmall organic molecule
Emp. Form.C16H20N2
Mol. Mass.240.3434
SMILESC=CCN(CCc1c[nH]c2ccccc12)CC=C