Reaction Details
TargetAlpha-1D adrenergic receptor
LigandBDBM50435344
Substrate/Competitorn/a
Meas. Tech.ChEMBL_1550145 (CHEMBL3756287)
Ki>10000±n/a nM
Citation Cozzi, NVDaley, PF Receptor binding profiles and quantitative structure-affinity relationships of some 5-substituted-N,N-diallyltryptamines. Bioorg Med Chem Lett26:959-64 (2016) 
 
Alpha-1D adrenergic receptor
Name:Alpha-1D adrenergic receptor
Type:Enzyme Catalytic Domain
Mol. Mass.:60485.82
Organism:Homo sapiens (Human)
Description:adrenergic Alpha1D ADRA1D HUMAN::P25100
Residue:572
BDBM50435344
NameBDBM50435344
Synonyms:CHEMBL2391541
TypeSmall organic molecule
Emp. Form.C17H22N2O
Mol. Mass.270.3694
SMILESCOc1ccc2[nH]cc(CCN(CC=C)CC=C)c2c1