Reaction Details
TargetAlpha-1A adrenergic receptor
LigandBDBM50435344
Substrate/Competitorn/a
Meas. Tech.ChEMBL_1550143 (CHEMBL3756285)
Ki>10000±n/a nM
Citation Cozzi, NVDaley, PF Receptor binding profiles and quantitative structure-affinity relationships of some 5-substituted-N,N-diallyltryptamines. Bioorg Med Chem Lett26:959-64 (2016) 
 
Alpha-1A adrenergic receptor
Name:Alpha-1A adrenergic receptor
Type:Cell-surface receptors
Mol. Mass.:51511.67
Organism:Homo sapiens (Human)
Description:P35348
Residue:466
BDBM50435344
NameBDBM50435344
Synonyms:CHEMBL2391541
TypeSmall organic molecule
Emp. Form.C17H22N2O
Mol. Mass.270.3694
SMILESCOc1ccc2[nH]cc(CCN(CC=C)CC=C)c2c1