Reaction Details
TargetAlpha-1B adrenergic receptor
LigandBDBM50140058
Substrate/Competitorn/a
Meas. Tech.ChEMBL_1550144 (CHEMBL3756286)
Ki 1259±n/a nM
Citation Cozzi, NVDaley, PF Receptor binding profiles and quantitative structure-affinity relationships of some 5-substituted-N,N-diallyltryptamines. Bioorg Med Chem Lett26:959-64 (2016) 
 
Alpha-1B adrenergic receptor
Name:Alpha-1B adrenergic receptor
Type:Enzyme
Mol. Mass.:56862.13
Organism:Homo sapiens (Human)
Description:P35368
Residue:520
BDBM50140058
NameBDBM50140058
Synonyms:CHEMBL3752576
TypeSmall organic molecule
Emp. Form.C16H20N2
Mol. Mass.240.3434
SMILESC=CCN(CCc1c[nH]c2ccccc12)CC=C