Reaction Details
Target5-hydroxytryptamine receptor 2C
LigandBDBM50140053
Substrate/Competitorn/a
Meas. Tech.ChEMBL_1550139 (CHEMBL3756281)
Ki<10000±n/a nM
Citation Cozzi, NVDaley, PF Receptor binding profiles and quantitative structure-affinity relationships of some 5-substituted-N,N-diallyltryptamines. Bioorg Med Chem Lett26:959-64 (2016) 
 
5-hydroxytryptamine receptor 2C
Name:5-hydroxytryptamine receptor 2C
Type:G Protein-Coupled Receptor (GPCR)
Mol. Mass.:51836.79
Organism:Homo sapiens (Human)
Description:P28335
Residue:458
BDBM50140053
NameBDBM50140053
Synonyms:CHEMBL3754496
TypeSmall organic molecule
Emp. Form.C16H19FN2
Mol. Mass.258.3339
SMILESFc1ccc2[nH]cc(CCN(CC=C)CC=C)c2c1