Reaction Details
TargetS-adenosylhomocysteine hydrolase-like protein 1
LigandBDBM50140074
Substrate/Competitorn/a
Meas. Tech.ChEMBL_1547422 (CHEMBL3757541)
IC50 2.7±n/a nM
Citation Liu, CChen, QSchneller, SW Enantiomeric 3-deaza-1',6'-isoneplanocin and its 3-bromo analogue: Synthesis by the Ullmann reaction and their antiviral properties. Bioorg Med Chem Lett26:928-30 (2016) 
 
S-adenosylhomocysteine hydrolase-like protein 1
Name:S-adenosylhomocysteine hydrolase-like protein 1
Type:PROTEIN
Mol. Mass.:58952.83
Organism:Homo sapiens (Human)
Description:ChEMBL_116703
Residue:530
BDBM50140074
NameBDBM50140074
Synonyms:CHEMBL2059155 | US10227373, Compound 3-Bromo-3-deazaneplanocin
TypeSmall organic molecule
Emp. Form.C12H13BrN4O3
Mol. Mass.341.161
SMILESNc1ncc(Br)c2n(cnc12)[C@@H]1C=C(CO)[C@@H](O)[C@H]1O