Reaction Details
TargetS-adenosylhomocysteine hydrolase-like protein 1
LigandBDBM50140075
Substrate/Competitorn/a
Meas. Tech.ChEMBL_1547422 (CHEMBL3757541)
IC50 3.2±n/a nM
Citation Liu, CChen, QSchneller, SW Enantiomeric 3-deaza-1',6'-isoneplanocin and its 3-bromo analogue: Synthesis by the Ullmann reaction and their antiviral properties. Bioorg Med Chem Lett26:928-30 (2016) 
 
S-adenosylhomocysteine hydrolase-like protein 1
Name:S-adenosylhomocysteine hydrolase-like protein 1
Type:PROTEIN
Mol. Mass.:58952.83
Organism:Homo sapiens (Human)
Description:ChEMBL_116703
Residue:530
BDBM50140075
NameBDBM50140075
Synonyms:CHEMBL3753637
TypeSmall organic molecule
Emp. Form.C12H14N4O3
Mol. Mass.262.2646
SMILESNc1nccc2n(cnc12)C1=C[C@H](CO)[C@@H](O)[C@H]1O