Reaction Details
TargetTransient receptor potential cation channel subfamily A member 1
LigandBDBM50131688
Substrate/Competitorn/a
Meas. Tech.ChEMBL_1547473 (CHEMBL3757750)
EC50 3600±n/a nM
Citation Nalli, MOrtar, GMoriello, ASMorera, EDi Marzo, VDe Petrocellis, L TRPA1 channels as targets for resveratrol and related stilbenoids. Bioorg Med Chem Lett26:899-902 (2016) 
 
Transient receptor potential cation channel subfamily A member 1
Name:Transient receptor potential cation channel subfamily A member 1
Type:PROTEIN
Mol. Mass.:128622.74
Organism:Rattus norvegicus
Description:ChEMBL_1450487
Residue:1125
BDBM50131688
NameBDBM50131688
Synonyms:(E)-4-(3,5-dimethoxystyryl)phenol 4'-hydroxy-3,5-dimethoxy stilbene 4-[(E)-2-(3,5-Dimethoxy-phenyl)-vinyl]-phenol CHEMBL83527 Pterostilben | Pterostilbene
TypeSmall organic molecule
Emp. Form.C16H16O3
Mol. Mass.256.2964
SMILESCOc1cc(OC)cc(\C=C\c2ccc(O)cc2)c1