Reaction Details
TargetTransient receptor potential cation channel subfamily A member 1
LigandBDBM23926
Substrate/Competitorn/a
Meas. Tech.ChEMBL_1547636 (CHEMBL3755506)
IC50 1400±n/a nM
Citation Nalli, MOrtar, GMoriello, ASMorera, EDi Marzo, VDe Petrocellis, L TRPA1 channels as targets for resveratrol and related stilbenoids. Bioorg Med Chem Lett26:899-902 (2016) 
 
Transient receptor potential cation channel subfamily A member 1
Name:Transient receptor potential cation channel subfamily A member 1
Type:PROTEIN
Mol. Mass.:128622.74
Organism:Rattus norvegicus
Description:ChEMBL_1450487
Residue:1125
BDBM23926
NameBDBM23926
Synonyms:(E)-resveratrol CHEMBL165 Stilbene, 2f cid_445154 trans-resveratrol
TypeSmall organic molecule
Emp. Form.C14H12O3
Mol. Mass.228.2433
SMILESOc1ccc(\C=C\c2cc(O)cc(O)c2)cc1