Reaction Details
TargetTransient receptor potential cation channel subfamily A member 1
LigandBDBM23928
Substrate/Competitorn/a
Meas. Tech.ChEMBL_1547472 (CHEMBL3757749)
IC50 3000±n/a nM
Citation Nalli, MOrtar, GMoriello, ASMorera, EDi Marzo, VDe Petrocellis, L TRPA1 channels as targets for resveratrol and related stilbenoids. Bioorg Med Chem Lett26:899-902 (2016) 
 
Transient receptor potential cation channel subfamily A member 1
Name:Transient receptor potential cation channel subfamily A member 1
Type:PROTEIN
Mol. Mass.:128622.74
Organism:Rattus norvegicus
Description:ChEMBL_1450487
Residue:1125
BDBM23928
NameBDBM23928
Synonyms:1,3-dimethoxy-5-[(E)-2-(4-methoxyphenyl)ethenyl]benzene trans-Stilbene Derivative, 4a
TypeSmall organic molecule
Emp. Form.C17H18O3
Mol. Mass.270.323
SMILESCOc1ccc(\C=C\c2cc(OC)cc(OC)c2)cc1