Reaction Details
TargetHistone deacetylase 2
LigandBDBM50140176
Substrate/Competitorn/a
Meas. Tech.ChEMBL_1547659 (CHEMBL3755710)
IC50 6360±n/a nM
Citation Ai, TQiu, LXie, JGeraghty, RJChen, L Design and synthesis of an activity-based protein profiling probe derived from cinnamic hydroxamic acid. Bioorg Med Chem24:686-92 (2016) 
 
Histone deacetylase 2
Name:Histone deacetylase 2
Type:Chromatin regulator; hydrolase; repressor
Mol. Mass.:55356.54
Organism:Homo sapiens (Human)
Description:Q92769
Residue:488
BDBM50140176
NameBDBM50140176
Synonyms:CHEMBL3394285
TypeSmall organic molecule
Emp. Form.C10H8F3NO2
Mol. Mass.231.1712
SMILESONC(=O)\C=C\c1ccc(cc1)C(F)(F)F