Reaction Details
Target72 kDa type IV collagenase
LigandBDBM50140176
Substrate/Competitorn/a
Meas. Tech.ChEMBL_1547670 (CHEMBL3755721)
IC50>100000±n/a nM
Citation Ai, TQiu, LXie, JGeraghty, RJChen, L Design and synthesis of an activity-based protein profiling probe derived from cinnamic hydroxamic acid. Bioorg Med Chem24:686-92 (2016) 
 
72 kDa type IV collagenase
Name:72 kDa type IV collagenase
Type:Enzyme
Mol. Mass.:73870.36
Organism:Homo sapiens (Human)
Description: P08253
Residue:660
BDBM50140176
NameBDBM50140176
Synonyms:CHEMBL3394285
TypeSmall organic molecule
Emp. Form.C10H8F3NO2
Mol. Mass.231.1712
SMILESONC(=O)\C=C\c1ccc(cc1)C(F)(F)F