Reaction Details
TargetBcl-2-like protein 1
LigandBDBM50140247
Substrate/Competitorn/a
Meas. Tech.ChEMBL_1548130 (CHEMBL3754932)
Ki 2.0±n/a nM
Citation Wójcik, PBerlicki, L Peptide-based inhibitors of protein-protein interactions. Bioorg Med Chem Lett26:707-13 (2016) 
 
Bcl-2-like protein 1
Name:Bcl-2-like protein 1
Type:Mitochondrion membrane; Single-pass membrane protein
Mol. Mass.:26039.60
Organism:Homo sapiens (Human)
Description:n/a
Residue:233
BDBM50140247
NameBDBM50140247
Synonyms:CHEMBL3754255
TypeSmall organic molecule
Emp. Form.C80H131N25O19
Mol. Mass.1747.0522
SMILESCC(C)C[C@H](NC(=O)[C@H](CCCCN)NC(=O)[C@H]1CCC[C@@H]1NC(=O)[C@H](CC(C)C)NC(=O)[C@H]1CCC[C@@H]1NC(=O)[C@H](CCCNC(N)=N)NC(=O)[C@H]1CCC[C@@H]1NC(=O)[C@H](C)NC(=O)[C@H]1CNC[C@@H]1NC(C)=O)C(=O)NCC(=O)N[C@@H](CC(O)=O)C(=O)N[C@@H](C)C(=O)N[C@@H](Cc1ccccc1)C(=O)N[C@@H](CC(N)=O)C(=O)N[C@@H](CCCNC(N)=N)C(N)=O