Reaction Details
TargetAdenosine receptor A1
LigandBDBM50140342
Substrate/Competitorn/a
Meas. Tech.ChEMBL_1548613 (CHEMBL3757432)
Ki 2.0±n/a nM
Citation Robinson, SJPetzer, JPRousseau, ALTerre'Blanche, GPetzer, ALourens, AC Carbamate substituted 2-amino-4,6-diphenylpyrimidines as adenosine receptor antagonists. Bioorg Med Chem Lett26:734-8 (2016) 
 
Adenosine receptor A1
Name:Adenosine receptor A1
Type:Protein
Mol. Mass.:36704.13
Organism:Rattus norvegicus (rat)
Description:n/a
Residue:326
BDBM50140342
NameBDBM50140342
Synonyms:CHEMBL3753339
TypeSmall organic molecule
Emp. Form.C22H22N4O2
Mol. Mass.374.4357
SMILESNc1nc(cc(n1)-c1cccc(OC(=O)N2CCCCC2)c1)-c1ccccc1