Reaction Details
TargetAdenosine receptor A2a
LigandBDBM50140314
Substrate/Competitorn/a
Meas. Tech.ChEMBL_1548614 (CHEMBL3757433)
Ki 1.6±n/a nM
Citation Robinson, SJPetzer, JPRousseau, ALTerre'Blanche, GPetzer, ALourens, AC Carbamate substituted 2-amino-4,6-diphenylpyrimidines as adenosine receptor antagonists. Bioorg Med Chem Lett26:734-8 (2016) 
 
Adenosine receptor A2a
Name:Adenosine receptor A2a
Type:G Protein-Coupled Receptor (GPCR)
Mol. Mass.:45015.65
Organism:Rattus norvegicus (rat)
Description:Rat A2A receptors expressed in CHO cells.
Residue:410
BDBM50140314
NameBDBM50140314
Synonyms:CHEMBL3753390
TypeSmall organic molecule
Emp. Form.C22H23N5O2
Mol. Mass.389.4503
SMILESCN1CCN(CC1)C(=O)Oc1cccc(c1)-c1cc(nc(N)n1)-c1ccccc1