Reaction Details
TargetDelta-type opioid receptor
LigandBDBM50142690
Substrate/Competitorn/a
Meas. Tech.ChEMBL_1552648 (CHEMBL3762587)
EC50 0.870000±n/a nM
Citation Turnaturi, RAricò, GRonsisvalle, GParenti, CPasquinucci, L Multitarget opioid ligands in pain relief: New players in an old game. Eur J Med Chem108:211-28 (2016) 
 
Delta-type opioid receptor
Name:Delta-type opioid receptor
Type:G Protein-Coupled Receptor (GPCR)
Mol. Mass.:40382.98
Organism:Homo sapiens (Human)
Description:Competition binding assays were carried out using membrane preparations from transfected HN9.10 cells that constitutively expressed the delta opioid receptor.
Residue:372
BDBM50142690
NameBDBM50142690
Synonyms:CHEMBL3759489
TypeSmall organic molecule
Emp. Form.C33H34N2O2
Mol. Mass.490.6353
SMILES[H][C@@]12Cc3ccc(O)c4O[C@@]5(C)c6[nH]c7ccccc7c6C[C@]1(CCCc1ccccc1)[C@@]5(CCN2C)c34