Reaction Details
TargetMu-type opioid receptor
LigandBDBM50142695
Substrate/Competitorn/a
Meas. Tech.ChEMBL_1552650 (CHEMBL3762589)
Ki 0.270000±n/a nM
Citation Turnaturi, RAricò, GRonsisvalle, GParenti, CPasquinucci, L Multitarget opioid ligands in pain relief: New players in an old game. Eur J Med Chem108:211-28 (2016) 
 
Mu-type opioid receptor
Name:Mu-type opioid receptor
Type:G Protein-Coupled Receptor (GPCR)
Mol. Mass.:44503.11
Organism:Rattus norvegicus (rat)
Description:Competition binding assays were carried out using membrane preparations from transfected HN9.10 cells that constitutively expressed the mu opioid receptor.
Residue:398
BDBM50142695
NameBDBM50142695
Synonyms:CHEMBL3759663
TypeSmall organic molecule
Emp. Form.C33H38N6O6S2
Mol. Mass.678.821
SMILESN[C@@H](Cc1ccc(O)cc1)C(=O)N[C@@H]1CSSC[C@H](NC(=O)[C@H](Cc2ccccc2)NC(=O)[C@H](Cc2ccccc2)NC1=O)C(N)=O