Reaction Details
TargetDelta-type opioid receptor
LigandBDBM50041144
Substrate/Competitorn/a
Meas. Tech.ChEMBL_1552640 (CHEMBL3762579)
Ki 3±n/a nM
Citation Turnaturi, RAricò, GRonsisvalle, GParenti, CPasquinucci, L Multitarget opioid ligands in pain relief: New players in an old game. Eur J Med Chem108:211-28 (2016) 
 
Delta-type opioid receptor
Name:Delta-type opioid receptor
Type:G Protein-Coupled Receptor (GPCR)
Mol. Mass.:40465.04
Organism:Rattus norvegicus (rat)
Description:Competition binding assays were using CHO-K1 cell membranes expressing the opioid receptor.
Residue:372
BDBM50041144
NameBDBM50041144
Synonyms:(S)-2-Amino-N-((5S,8S)-5-benzyl-4,7,13,16-tetraoxo-hexadecahydro-3a,6,12,15-tetraaza-cyclopentacyclopentadecen-8-yl)-3-(4-hydroxy-phenyl)-propionamide | CHEMBL557035
TypeSmall organic molecule
Emp. Form.C37H39N5O5
Mol. Mass.633.7361
SMILESN[C@@H](Cc1ccc(O)cc1)C(=O)N1Cc2ccccc2C[C@H]1C(=O)N[C@@H](Cc1ccccc1)C(=O)N[C@@H](Cc1ccccc1)C(N)=O