Reaction Details
TargetMu-type opioid receptor
LigandBDBM50142690
Substrate/Competitorn/a
Meas. Tech.ChEMBL_1552638 (CHEMBL3762577)
Ki 10±n/a nM
Citation Turnaturi, RAricò, GRonsisvalle, GParenti, CPasquinucci, L Multitarget opioid ligands in pain relief: New players in an old game. Eur J Med Chem108:211-28 (2016) 
 
Mu-type opioid receptor
Name:Mu-type opioid receptor
Type:G Protein-Coupled Receptor (GPCR)
Mol. Mass.:44789.51
Organism:Homo sapiens (Human)
Description:P35372
Residue:400
BDBM50142690
NameBDBM50142690
Synonyms:CHEMBL3759489
TypeSmall organic molecule
Emp. Form.C33H34N2O2
Mol. Mass.490.6353
SMILES[H][C@@]12Cc3ccc(O)c4O[C@@]5(C)c6[nH]c7ccccc7c6C[C@]1(CCCc1ccccc1)[C@@]5(CCN2C)c34